Target
Orotidine 5'-phosphate decarboxylase
Ligand
BDBM83833
Substrate
Meas. Tech.
Luminescence-based cell-based high throughput dose response assay for activators of the GAA850 frataxin (FXN) promoter
EC50
>59644±n/a nM
Citation
 PubChem, PC Luminescence-based cell-based high throughput dose response assay for activators of the GAA850 frataxin (FXN) promoter PubChem Bioassay (2011)[AID] 
Target
Name:
Orotidine 5'-phosphate decarboxylase
Synonyms:
FXN frataxin pyrA | pyrG
Type:
Enzyme Catalytic Domain
Mol. Mass.:
30195.13
Organism:
Aspergillus niger
Description:
gi_2395
Residue:
277
  
Inhibitor
Name:
BDBM83833
Synonyms:
MLS002608893 N-(1-adamantylmethyl)-2-[(1S,12bS)-12b-ethyl-1-[4-(furan-2-carbonyl)piperazine-1-carbonyl]-9-methoxy-4-oxo-1,2,3,6,7,12-hexahydroindolo[2,3-a]quinolizin-3-yl]acetamide N-(1-adamantylmethyl)-2-[(1S,12bS)-12b-ethyl-1-[[4-[2-furanyl(oxo)methyl]-1-piperazinyl]-oxomethyl]-9-methoxy-4-oxo-1,2,3,6,7,12-hexahydroindolo[2,3-a]quinolizin-3-yl]acetamide cid_44601827
Type:
Small organic molecule
Emp. Form.:
C41H51N5O6
Mol. Mass.:
709.8735
SMILES:
[H]C12CC3([H])CC([H])(C1)CC(CNC(=O)CC1C[C@H](C(=O)N4CCN(CC4)C(=O)c4ccco4)[C@]4(CC)N(CCc5c4[nH]c4ccc(OC)cc54)C1=O)(C2)C3
: