Target
Apoptotic protease-activating factor 1
Ligand
BDBM30725
Substrate
Meas. Tech.
Dose response confirmation of uHTS hits for Apaf-1 in a Fluorescent assay
IC50
12600±n/a nM
Citation
 PubChem, PC Dose response confirmation of uHTS hits for Apaf-1 in a Fluorescent assay PubChem Bioassay (2011)[AID] 
Target
Name:
Apoptotic protease-activating factor 1
Synonyms:
APAF1 Apoptotic peptidase activating factor 1 | KIAA0413
Type:
Enzyme Catalytic Domain
Mol. Mass.:
141834.40
Organism:
Homo sapiens (Human)
Description:
O14727
Residue:
1248
  
Inhibitor
Name:
BDBM30725
Synonyms:
MLS000079925 N-[3-cyano-1-(4-methoxyphenyl)pyrrolo[3,2-b]quinoxalin-2-yl]-2-furamide SMR000039887 | cid_658939
Type:
Small organic molecule
Emp. Form.:
C23H15N5O3
Mol. Mass.:
409.3969
SMILES:
COc1ccc(cc1)-n1c(NC(=O)c2ccco2)c(C#N)c2nc3ccccc3nc12
: