Target
Apoptotic protease-activating factor 1
Ligand
BDBM30768
Substrate
Meas. Tech.
Dose response confirmation of uHTS hits for Apaf-1 in a Fluorescent assay
IC50
46200±n/a nM
Citation
 PubChem, PC Dose response confirmation of uHTS hits for Apaf-1 in a Fluorescent assay PubChem Bioassay (2011)[AID] 
Target
Name:
Apoptotic protease-activating factor 1
Synonyms:
APAF1 Apoptotic peptidase activating factor 1 | KIAA0413
Type:
Enzyme Catalytic Domain
Mol. Mass.:
141834.40
Organism:
Homo sapiens (Human)
Description:
O14727
Residue:
1248
  
Inhibitor
Name:
BDBM30768
Synonyms:
2-amino-1-(3-methoxypropyl)-N-(3-methylbutyl)-3-pyrrolo[3,2-b]quinoxalinecarboxamide 2-amino-N-isoamyl-1-(3-methoxypropyl)pyrrolo[3,2-b]quinoxaline-3-carboxamide MLS000041744 US9073941, 1012 | cid_663108
Type:
Small organic molecule
Emp. Form.:
C20H27N5O2
Mol. Mass.:
369.4607
SMILES:
COCCCn1c(N)c(C(=O)NCCC(C)C)c2nc3ccccc3nc12
: