Target
Apoptotic protease-activating factor 1
Ligand
BDBM51771
Substrate
Meas. Tech.
Dose response confirmation of uHTS hits for Apaf-1 in a Fluorescent assay
IC50
79±n/a nM
Citation
 PubChem, PC Dose response confirmation of uHTS hits for Apaf-1 in a Fluorescent assay PubChem Bioassay (2011)[AID] 
Target
Name:
Apoptotic protease-activating factor 1
Synonyms:
APAF1 Apoptotic peptidase activating factor 1 | KIAA0413
Type:
Enzyme Catalytic Domain
Mol. Mass.:
141834.40
Organism:
Homo sapiens (Human)
Description:
O14727
Residue:
1248
  
Inhibitor
Name:
BDBM51771
Synonyms:
1,6-dimethyl-3-(2-pyridinyl)pyrimido[5,4-e][1,2,4]triazine-5,7(1H,6H)-dione 1,6-dimethyl-3-(2-pyridyl)pyrimido[5,4-e][1,2,4]triazine-5,7-quinone 1,6-dimethyl-3-pyridin-2-ylpyrimido[5,4-e][1,2,4]triazine-5,7-dione SMR000291658 | cid_906542
Type:
Small organic molecule
Emp. Form.:
C12H10N6O2
Mol. Mass.:
270.2468
SMILES:
Cn1nc(nc2c1nc(=O)n(C)c2=O)-c1ccccn1
: