Target
Apoptotic protease-activating factor 1
Ligand
BDBM50099763
Substrate
Meas. Tech.
Dose response confirmation of uHTS hits for Apaf-1 in a Fluorescent assay
IC50
2230±n/a nM
Citation
 PubChem, PC Dose response confirmation of uHTS hits for Apaf-1 in a Fluorescent assay PubChem Bioassay (2011)[AID] 
Target
Name:
Apoptotic protease-activating factor 1
Synonyms:
APAF1 Apoptotic peptidase activating factor 1 | KIAA0413
Type:
Enzyme Catalytic Domain
Mol. Mass.:
141834.40
Organism:
Homo sapiens (Human)
Description:
O14727
Residue:
1248
  
Inhibitor
Name:
BDBM50099763
Synonyms:
4-Phenylamino-[1,2]naphthoquinone cid_344131
Type:
Small organic molecule
Emp. Form.:
C16H11NO2
Mol. Mass.:
249.264
SMILES:
O=C1C=C(Nc2ccccc2)c2ccccc2C1=O
: