Target
Apoptotic protease-activating factor 1
Ligand
BDBM46593
Substrate
Meas. Tech.
Dose response confirmation of uHTS hits for Apaf-1 in a Fluorescent assay
IC50
2700±n/a nM
Citation
 PubChem, PC Dose response confirmation of uHTS hits for Apaf-1 in a Fluorescent assay PubChem Bioassay (2011)[AID] 
Target
Name:
Apoptotic protease-activating factor 1
Synonyms:
APAF1 Apoptotic peptidase activating factor 1 | KIAA0413
Type:
Enzyme Catalytic Domain
Mol. Mass.:
141834.40
Organism:
Homo sapiens (Human)
Description:
O14727
Residue:
1248
  
Inhibitor
Name:
BDBM46593
Synonyms:
2,6-bis(chloranyl)-N-[2-oxidanyl-1,3-bis(oxidanylidene)inden-2-yl]benzamide 2,6-dichloro-N-(2-hydroxy-1,3-dioxo-2,3-dihydro-1H-inden-2-yl)benzamide 2,6-dichloro-N-(2-hydroxy-1,3-dioxoinden-2-yl)benzamide SMR000458146 | cid_2810445
Type:
Small organic molecule
Emp. Form.:
C16H9Cl2NO4
Mol. Mass.:
350.153
SMILES:
OC1(NC(=O)c2c(Cl)cccc2Cl)C(=O)c2ccccc2C1=O
: