Target
Apoptotic protease-activating factor 1
Ligand
BDBM83996
Substrate
Meas. Tech.
Dose response confirmation of uHTS hits for Apaf-1 in a Fluorescent assay
IC50
2140±n/a nM
Citation
 PubChem, PC Dose response confirmation of uHTS hits for Apaf-1 in a Fluorescent assay PubChem Bioassay (2011)[AID] 
Target
Name:
Apoptotic protease-activating factor 1
Synonyms:
APAF1 Apoptotic peptidase activating factor 1 | KIAA0413
Type:
Enzyme Catalytic Domain
Mol. Mass.:
141834.40
Organism:
Homo sapiens (Human)
Description:
O14727
Residue:
1248
  
Inhibitor
Name:
BDBM83996
Synonyms:
(NE)-N-[3-(4-hydroxyanilino)-4-keto-1-naphthylidene]-4-methyl-benzenesulfonamide (NE)-N-[3-(4-hydroxyanilino)-4-oxonaphthalen-1-ylidene]-4-methylbenzenesulfonamide MLS002249002 cid_9661009
Type:
Small organic molecule
Emp. Form.:
C23H18N2O4S
Mol. Mass.:
418.465
SMILES:
Cc1ccc(cc1)S(=O)(=O)N=C1C=C(Nc2ccc(O)cc2)C(=O)c2ccccc12
: