Target
Apoptotic protease-activating factor 1
Ligand
BDBM34461
Substrate
Meas. Tech.
Dose Response validation of Inhibitors of Apaf-1 using a Fluorescent Interference Counterscreen assay
IC50
>100000±0 nM
Citation
 PubChem, PC Dose Response validation of Inhibitors of Apaf-1 using a Fluorescent Interference Counterscreen assay PubChem Bioassay (2011)[AID] 
Target
Name:
Apoptotic protease-activating factor 1
Synonyms:
APAF1 Apoptotic peptidase activating factor 1 | KIAA0413
Type:
Enzyme Catalytic Domain
Mol. Mass.:
141834.40
Organism:
Homo sapiens (Human)
Description:
O14727
Residue:
1248
  
Inhibitor
Name:
BDBM34461
Synonyms:
6-(2-chlorophenyl)-3-(4-pyridinyl)[1,2,4]triazolo[3,4-b][1,3,4]thiadiazole 6-(2-chlorophenyl)-3-pyridin-4-yl-[1,2,4]triazolo[3,4-b][1,3,4]thiadiazole SMR000081087 | cid_937213
Type:
Small organic molecule
Emp. Form.:
C14H8ClN5S
Mol. Mass.:
313.765
SMILES:
Clc1ccccc1-c1nn2c(nnc2s1)-c1ccncc1
: