Target
Apoptotic protease-activating factor 1
Ligand
BDBM42197
Substrate
Meas. Tech.
Dose Response validation of Inhibitors of Apaf-1 using a Fluorescent Interference Counterscreen assay
IC50
>100000±0 nM
Citation
 PubChem, PC Dose Response validation of Inhibitors of Apaf-1 using a Fluorescent Interference Counterscreen assay PubChem Bioassay (2011)[AID] 
Target
Name:
Apoptotic protease-activating factor 1
Synonyms:
APAF1 Apoptotic peptidase activating factor 1 | KIAA0413
Type:
Enzyme Catalytic Domain
Mol. Mass.:
141834.40
Organism:
Homo sapiens (Human)
Description:
O14727
Residue:
1248
  
Inhibitor
Name:
BDBM42197
Synonyms:
10-(4-chlorophenyl)-[1,3]thiazolo[3,2-a]perimidine 10-(4-chlorophenyl)thiazolo[3,2-a]perimidine SMR000115638 | cid_1818715
Type:
Small organic molecule
Emp. Form.:
C19H11ClN2S
Mol. Mass.:
334.822
SMILES:
Clc1ccc(cc1)-c1csc2nc3cccc4cccc(c34)n12
: