Target
Apoptotic protease-activating factor 1
Ligand
BDBM47197
Substrate
Meas. Tech.
Dose Response validation of Inhibitors of Apaf-1 using a Fluorescent Interference Counterscreen assay
IC50
>100000±0 nM
Citation
 PubChem, PC Dose Response validation of Inhibitors of Apaf-1 using a Fluorescent Interference Counterscreen assay PubChem Bioassay (2011)[AID] 
Target
Name:
Apoptotic protease-activating factor 1
Synonyms:
APAF1 Apoptotic peptidase activating factor 1 | KIAA0413
Type:
Enzyme Catalytic Domain
Mol. Mass.:
141834.40
Organism:
Homo sapiens (Human)
Description:
O14727
Residue:
1248
  
Inhibitor
Name:
BDBM47197
Synonyms:
6-(4-bromophenyl)-2-(methylsulfonyl)-4-phenylnicotinonitrile 6-(4-bromophenyl)-2-methylsulfonyl-4-phenyl-3-pyridinecarbonitrile 6-(4-bromophenyl)-2-methylsulfonyl-4-phenylpyridine-3-carbonitrile SMR000143010 | cid_1317357
Type:
Small organic molecule
Emp. Form.:
C19H13BrN2O2S
Mol. Mass.:
413.288
SMILES:
CS(=O)(=O)c1nc(cc(-c2ccccc2)c1C#N)-c1ccc(Br)cc1
: