Target
Apoptotic protease-activating factor 1
Ligand
BDBM51840
Substrate
Meas. Tech.
Dose Response validation of Inhibitors of Apaf-1 using a Fluorescent Interference Counterscreen assay
IC50
>100000±0 nM
Citation
 PubChem, PC Dose Response validation of Inhibitors of Apaf-1 using a Fluorescent Interference Counterscreen assay PubChem Bioassay (2011)[AID] 
Target
Name:
Apoptotic protease-activating factor 1
Synonyms:
APAF1 Apoptotic peptidase activating factor 1 | KIAA0413
Type:
Enzyme Catalytic Domain
Mol. Mass.:
141834.40
Organism:
Homo sapiens (Human)
Description:
O14727
Residue:
1248
  
Inhibitor
Name:
BDBM51840
Synonyms:
(2Z)-3-ethyl-2-[(1-ethyl-6-methyl-2-quinolin-1-iumyl)methylidene]-5,6-dimethyl-1,3-benzothiazole;iodide (2Z)-3-ethyl-2-[(1-ethyl-6-methyl-quinolin-1-ium-2-yl)methylidene]-5,6-dimethyl-1,3-benzothiazole;iodide MLS000692767 cid_16192804
Type:
Small organic molecule
Emp. Form.:
C24H27N2S
Mol. Mass.:
375.549
SMILES:
CCN1\C(Sc2cc(C)c(C)cc12)=C\c1ccc2cc(C)ccc2[n+]1CC
: