Target
Apoptotic protease-activating factor 1
Ligand
BDBM57870
Substrate
Meas. Tech.
Dose Response validation of Inhibitors of Apaf-1 using a Fluorescent Interference Counterscreen assay
IC50
>100000±0 nM
Citation
 PubChem, PC Dose Response validation of Inhibitors of Apaf-1 using a Fluorescent Interference Counterscreen assay PubChem Bioassay (2011)[AID] 
Target
Name:
Apoptotic protease-activating factor 1
Synonyms:
APAF1 Apoptotic peptidase activating factor 1 | KIAA0413
Type:
Enzyme Catalytic Domain
Mol. Mass.:
141834.40
Organism:
Homo sapiens (Human)
Description:
O14727
Residue:
1248
  
Inhibitor
Name:
BDBM57870
Synonyms:
(2Z)-1-ethyl-2-[(1-ethyl-6-methyl-2-quinolin-1-iumyl)methylidene]thieno[3,2-e][1,3]benzothiazole;iodide (2Z)-1-ethyl-2-[(1-ethyl-6-methyl-quinolin-1-ium-2-yl)methylidene]thieno[3,2-e][1,3]benzothiazole;iodide 1-ethyl-2-[(Z)-(1-ethylthieno[3,2-e][1,3]benzothiazol-2(1H)-ylidene)methyl]-6-methylquinolinium SMR000305930 | cid_16193285
Type:
Small organic molecule
Emp. Form.:
C24H23N2S2
Mol. Mass.:
403.582
SMILES:
CCN1\C(Sc2ccc3sccc3c12)=C\c1ccc2cc(C)ccc2[n+]1CC
: