Target
Apoptotic protease-activating factor 1
Ligand
BDBM71267
Substrate
Meas. Tech.
Dose Response validation of Inhibitors of Apaf-1 using a Fluorescent Interference Counterscreen assay
IC50
>100000±0 nM
Citation
 PubChem, PC Dose Response validation of Inhibitors of Apaf-1 using a Fluorescent Interference Counterscreen assay PubChem Bioassay (2011)[AID] 
Target
Name:
Apoptotic protease-activating factor 1
Synonyms:
APAF1 Apoptotic peptidase activating factor 1 | KIAA0413
Type:
Enzyme Catalytic Domain
Mol. Mass.:
141834.40
Organism:
Homo sapiens (Human)
Description:
O14727
Residue:
1248
  
Inhibitor
Name:
BDBM71267
Synonyms:
3-(2-pyridinylamino)-2H-isoquinolin-1-one 3-(pyridin-2-ylamino)-2H-isoquinolin-1-one SMR000472414 | cid_16727381
Type:
Small organic molecule
Emp. Form.:
C14H11N3O
Mol. Mass.:
237.2566
SMILES:
O=c1[nH]c(Nc2ccccn2)cc2ccccc12
: