Target
Apoptotic protease-activating factor 1
Ligand
BDBM71372
Substrate
Meas. Tech.
Dose Response validation of Inhibitors of Apaf-1 using a Fluorescent Interference Counterscreen assay
IC50
>100000±0 nM
Citation
 PubChem, PC Dose Response validation of Inhibitors of Apaf-1 using a Fluorescent Interference Counterscreen assay PubChem Bioassay (2011)[AID] 
Target
Name:
Apoptotic protease-activating factor 1
Synonyms:
APAF1 Apoptotic peptidase activating factor 1 | KIAA0413
Type:
Enzyme Catalytic Domain
Mol. Mass.:
141834.40
Organism:
Homo sapiens (Human)
Description:
O14727
Residue:
1248
  
Inhibitor
Name:
BDBM71372
Synonyms:
2-(4-methoxybenzyl)-1,3(2H,4H)-isoquinolinedione 2-p-anisyl-4H-isoquinoline-1,3-quinone SMR000549780 | cid_1475552
Type:
Small organic molecule
Emp. Form.:
C17H15NO3
Mol. Mass.:
281.3059
SMILES:
COc1ccc(CN2C(=O)Cc3ccccc3C2=O)cc1
: