Target
Apoptotic protease-activating factor 1
Ligand
BDBM50696
Substrate
Meas. Tech.
Dose Response confirmation of uHTS Activators of the Apaf-1 Pathway in Fluorescent format
EC50
9480±n/a nM
Citation
 PubChem, PC Dose Response confirmation of uHTS Activators of the Apaf-1 Pathway in Fluorescent format PubChem Bioassay (2011)[AID] 
Target
Name:
Apoptotic protease-activating factor 1
Synonyms:
APAF1 Apoptotic peptidase activating factor 1 | KIAA0413
Type:
Enzyme Catalytic Domain
Mol. Mass.:
141834.40
Organism:
Homo sapiens (Human)
Description:
O14727
Residue:
1248
  
Inhibitor
Name:
BDBM50696
Synonyms:
3-[5-[(1-ketothiazolo[3,2-a]benzimidazol-2-ylidene)methyl]-2-furyl]benzoic acid 3-[5-[(1-oxo-2-thiazolo[3,2-a]benzimidazolylidene)methyl]-2-furanyl]benzoic acid 3-{5-[3-Oxo-benzo[4,5]imidazo[2,1-b]thiazol-(2E)-ylidenemethyl]-furan-2-yl}-benzoic acid SMR000413437 | cid_1492413
Type:
Small organic molecule
Emp. Form.:
C21H12N2O4S
Mol. Mass.:
388.396
SMILES:
OC(=O)c1cccc(c1)-c1ccc(C=c2sc3nc4ccccc4n3c2=O)o1
: