Target
Apoptotic protease-activating factor 1
Ligand
BDBM50714
Substrate
Meas. Tech.
Dose Response confirmation of uHTS Activators of the Apaf-1 Pathway in Fluorescent format
EC50
2350±n/a nM
Citation
 PubChem, PC Dose Response confirmation of uHTS Activators of the Apaf-1 Pathway in Fluorescent format PubChem Bioassay (2011)[AID] 
Target
Name:
Apoptotic protease-activating factor 1
Synonyms:
APAF1 Apoptotic peptidase activating factor 1 | KIAA0413
Type:
Enzyme Catalytic Domain
Mol. Mass.:
141834.40
Organism:
Homo sapiens (Human)
Description:
O14727
Residue:
1248
  
Inhibitor
Name:
BDBM50714
Synonyms:
(8S)-7-(4-chlorobenzoyl)-3-(3-methacrylamidophenyl)-1-oxa-2,7-diazaspiro[4.4]non-2-ene-8-carboxamide (8S)-7-(4-chlorophenyl)carbonyl-3-[3-(2-methylprop-2-enoylamino)phenyl]-1-oxa-2,7-diazaspiro[4.4]non-2-ene-8-carboxamide MLS000561936 cid_16745473
Type:
Small organic molecule
Emp. Form.:
C24H23ClN4O4
Mol. Mass.:
466.917
SMILES:
CC(=C)C(=O)Nc1cccc(c1)C1=NOC2(C[C@H](N(C2)C(=O)c2ccc(Cl)cc2)C(N)=O)C1
: