Target
Caspase-9
Ligand
BDBM47197
Substrate
Meas. Tech.
Dose response confirmation of uHTS hits for Apaf-1 using a LZ-Caspase-9/Caspase-3 Fluorescent Selectivity assay
IC50
1670±n/a nM
Citation
 PubChem, PC Dose response confirmation of uHTS hits for Apaf-1 using a LZ-Caspase-9/Caspase-3 Fluorescent Selectivity assay PubChem Bioassay (2011)[AID] 
Target
Name:
Caspase-9
Synonyms:
Apoptotic protease-activating factor 1/Caspase-3/Caspase-9/Cytochrome c CASP-9 CASP9_HUMAN ICE-like apoptotic protease 6 caspase-9 isoform alpha preproprotein
Type:
Enzyme
Mol. Mass.:
46277.29
Organism:
Homo sapiens (Human)
Description:
Residue:
416
  
Inhibitor
Name:
BDBM47197
Synonyms:
6-(4-bromophenyl)-2-(methylsulfonyl)-4-phenylnicotinonitrile 6-(4-bromophenyl)-2-methylsulfonyl-4-phenyl-3-pyridinecarbonitrile 6-(4-bromophenyl)-2-methylsulfonyl-4-phenylpyridine-3-carbonitrile SMR000143010 | cid_1317357
Type:
Small organic molecule
Emp. Form.:
C19H13BrN2O2S
Mol. Mass.:
413.288
SMILES:
CS(=O)(=O)c1nc(cc(-c2ccccc2)c1C#N)-c1ccc(Br)cc1
: