Target
Cysteine protease ATG4B
Ligand
BDBM84015
Substrate
Meas. Tech.
Dose response confirmation of the uHTS fluorescent assay for identification of inhibitors of ATG4B Set 2
IC50
77500±n/a nM
Citation
 PubChem, PC Dose response confirmation of the uHTS fluorescent assay for identification of inhibitors of ATG4B Set 2 PubChem Bioassay (2011)[AID] 
Target
Name:
Cysteine protease ATG4B
Synonyms:
APG4B ATG4B_HUMAN KIAA0943 hck
Type:
Enzyme Catalytic Domain
Mol. Mass.:
44279.79
Organism:
Homo sapiens (Human)
Description:
gi_47132611
Residue:
393
  
Inhibitor
Name:
BDBM84015
Synonyms:
MLS000583105 N-(2-furfuryl)-6,8-dimethyl-benzo[b][1,4]benzothiazepine-3-carboxamide N-(furan-2-ylmethyl)-6,8-dimethyl-benzo[b][1,4]benzothiazepine-3-carboxamide SMR000206291 | cid_12005218
Type:
Small organic molecule
Emp. Form.:
C21H18N2O2S
Mol. Mass.:
362.445
SMILES:
Cc1ccc2Sc3ccc(cc3N=C(C)c2c1)C(=O)NCc1ccco1
: