Target
Cysteine protease ATG4B
Ligand
BDBM51051
Substrate
Meas. Tech.
Dose response confirmation of the uHTS fluorescent assay for identification of inhibitors of ATG4B Set 2
IC50
>80000±n/a nM
Citation
 PubChem, PC Dose response confirmation of the uHTS fluorescent assay for identification of inhibitors of ATG4B Set 2 PubChem Bioassay (2011)[AID] 
Target
Name:
Cysteine protease ATG4B
Synonyms:
APG4B ATG4B_HUMAN KIAA0943 hck
Type:
Enzyme Catalytic Domain
Mol. Mass.:
44279.79
Organism:
Homo sapiens (Human)
Description:
gi_47132611
Residue:
393
  
Inhibitor
Name:
BDBM51051
Synonyms:
2-(6-morpholin-4-yl-1,3-dioxobenzo[de]isoquinolin-2-yl)ethyl 2-chlorobenzoate 2-chlorobenzoic acid 2-(1,3-diketo-6-morpholino-benzo[de]isoquinolin-2-yl)ethyl ester MLS000722239 cid_4051302
Type:
Small organic molecule
Emp. Form.:
C25H21ClN2O5
Mol. Mass.:
464.898
SMILES:
Clc1ccccc1C(=O)OCCN1C(=O)c2cccc3c(ccc(C1=O)c23)N1CCOCC1
: