Target
Apoptotic protease-activating factor 1
Ligand
BDBM84000
Substrate
Meas. Tech.
Dose Response validation of Activators of Apaf-1 using a Fluorescent Interference Counterscreen assay
EC50
>100000±0 nM
Citation
 PubChem, PC Dose Response validation of Activators of Apaf-1 using a Fluorescent Interference Counterscreen assay PubChem Bioassay (2011)[AID] 
Target
Name:
Apoptotic protease-activating factor 1
Synonyms:
APAF1 Apoptotic peptidase activating factor 1 | KIAA0413
Type:
Enzyme Catalytic Domain
Mol. Mass.:
141834.40
Organism:
Homo sapiens (Human)
Description:
O14727
Residue:
1248
  
Inhibitor
Name:
BDBM84000
Synonyms:
2-[4-[[(E)-3-(4-ethoxyphenyl)-3-oxidanylidene-prop-1-enyl]amino]phenyl]sulfonylguanidine 2-[4-[[(E)-3-keto-3-p-phenetyl-prop-1-enyl]amino]phenyl]sulfonylguanidine SMR000172025 | cid_5945218
Type:
Small organic molecule
Emp. Form.:
C18H20N4O4S
Mol. Mass.:
388.441
SMILES:
CCOc1ccc(cc1)C(=O)CC=Nc1ccc(cc1)S(=O)(=O)NC(N)=N
: