Target
Apoptotic protease-activating factor 1
Ligand
BDBM82950
Substrate
Meas. Tech.
Dose Response validation of Activators of Apaf-1 using a Fluorescent Interference Counterscreen assay
EC50
>100000±0 nM
Citation
 PubChem, PC Dose Response validation of Activators of Apaf-1 using a Fluorescent Interference Counterscreen assay PubChem Bioassay (2011)[AID] 
Target
Name:
Apoptotic protease-activating factor 1
Synonyms:
APAF1 Apoptotic peptidase activating factor 1 | KIAA0413
Type:
Enzyme Catalytic Domain
Mol. Mass.:
141834.40
Organism:
Homo sapiens (Human)
Description:
O14727
Residue:
1248
  
Inhibitor
Name:
BDBM82950
Synonyms:
3-(4-bromophenyl)sulfonyl-N-(2-ethoxyphenyl)propanamide 3-brosyl-N-o-phenetyl-propionamide SMR000564973 | cid_4109093
Type:
Small organic molecule
Emp. Form.:
C17H18BrNO4S
Mol. Mass.:
412.298
SMILES:
CCOc1ccccc1NC(=O)CCS(=O)(=O)c1ccc(Br)cc1
: