Target
Sentrin-specific protease 8
Ligand
BDBM76610
Substrate
Meas. Tech.
SAR Analysis of small molecule inhibitors of Sentrin-specific protease 8 (SENP8) using a Luminescent assay - Set 2
IC50
1650±n/a nM
Citation
 PubChem, PC SAR Analysis of small molecule inhibitors of Sentrin-specific protease 8 (SENP8) using a Luminescent assay - Set 2 PubChem Bioassay (2011)[AID] 
Target
Name:
Sentrin-specific protease 8
Synonyms:
DEN1 PRSC2 SENP8_HUMAN | SUMO/sentrin specific peptidase family member 8
Type:
Enzyme Catalytic Domain
Mol. Mass.:
24104.52
Organism:
Homo sapiens (Human)
Description:
gi_262118306
Residue:
212
  
Inhibitor
Name:
BDBM76610
Synonyms:
MLS001180657 N-(6-chloro-1,3-benzothiazol-2-yl)-5-methyl-2-furamide N-(6-chloro-1,3-benzothiazol-2-yl)-5-methylfuran-2-carboxamide cid_844224
Type:
Small organic molecule
Emp. Form.:
C13H9ClN2O2S
Mol. Mass.:
292.741
SMILES:
Cc1ccc(o1)C(=O)Nc1nc2ccc(Cl)cc2s1
: