Target
Sentrin-specific protease 8
Ligand
BDBM69619
Substrate
Meas. Tech.
SAR Analysis of small molecule inhibitors of Sentrin-specific protease 8 (SENP8) using a Luminescent assay - Set 2
IC50
5970±n/a nM
Citation
 PubChem, PC SAR Analysis of small molecule inhibitors of Sentrin-specific protease 8 (SENP8) using a Luminescent assay - Set 2 PubChem Bioassay (2011)[AID] 
Target
Name:
Sentrin-specific protease 8
Synonyms:
DEN1 PRSC2 SENP8_HUMAN | SUMO/sentrin specific peptidase family member 8
Type:
Enzyme Catalytic Domain
Mol. Mass.:
24104.52
Organism:
Homo sapiens (Human)
Description:
gi_262118306
Residue:
212
  
Inhibitor
Name:
BDBM69619
Synonyms:
MLS001178533 N-(6-chloro-1,3-benzothiazol-2-yl)cyclopropanecarboxamide cid_673490
Type:
Small organic molecule
Emp. Form.:
C11H9ClN2OS
Mol. Mass.:
252.72
SMILES:
Clc1ccc2nc(NC(=O)C3CC3)sc2c1
: