Target
Sentrin-specific protease 8
Ligand
BDBM84031
Substrate
Meas. Tech.
SAR Analysis of small molecule inhibitors of Sentrin-specific protease 8 (SENP8) using a Luminescent assay - Set 2
IC50
16700±n/a nM
Citation
 PubChem, PC SAR Analysis of small molecule inhibitors of Sentrin-specific protease 8 (SENP8) using a Luminescent assay - Set 2 PubChem Bioassay (2011)[AID] 
Target
Name:
Sentrin-specific protease 8
Synonyms:
DEN1 PRSC2 SENP8_HUMAN | SUMO/sentrin specific peptidase family member 8
Type:
Enzyme Catalytic Domain
Mol. Mass.:
24104.52
Organism:
Homo sapiens (Human)
Description:
gi_262118306
Residue:
212
  
Inhibitor
Name:
BDBM84031
Synonyms:
5-(3-methylphenyl)-3-[(E)-2-phenylethenyl]-1,2,4-oxadiazole MLS-0454387.0001 | cid_49852530
Type:
Small organic molecule
Emp. Form.:
C17H14N2O
Mol. Mass.:
262.3059
SMILES:
Cc1cccc(c1)-c1nc(\C=C\c2ccccc2)no1
: