Target
Sentrin-specific protease 8
Ligand
BDBM84054
Substrate
Meas. Tech.
SAR Analysis of small molecule inhibitors of Sentrin-specific protease 8 (SENP8) using a Luminescent assay - Set 2
IC50
46300±n/a nM
Citation
 PubChem, PC SAR Analysis of small molecule inhibitors of Sentrin-specific protease 8 (SENP8) using a Luminescent assay - Set 2 PubChem Bioassay (2011)[AID] 
Target
Name:
Sentrin-specific protease 8
Synonyms:
DEN1 PRSC2 SENP8_HUMAN | SUMO/sentrin specific peptidase family member 8
Type:
Enzyme Catalytic Domain
Mol. Mass.:
24104.52
Organism:
Homo sapiens (Human)
Description:
gi_262118306
Residue:
212
  
Inhibitor
Name:
BDBM84054
Synonyms:
2-[2-methoxy-4-[(E)-2-[(5E)-5-(6-oxidanylidenecyclohexa-2,4-dien-1-ylidene)-2H-1,2,4-oxadiazol-3-yl]ethenyl]phenoxy]ethanoic acid 2-[2-methoxy-4-[(E)-2-[(5E)-5-(6-oxocyclohexa-2,4-dien-1-ylidene)-2H-1,2,4-oxadiazol-3-yl]ethenyl]phenoxy]acetic acid MLS-0454376.0002 | cid_16474171
Type:
Small organic molecule
Emp. Form.:
C19H16N2O6
Mol. Mass.:
368.3401
SMILES:
COc1cc(C=Cc2noc(n2)-c2ccccc2O)ccc1OCC(O)=O
: