Target
Sentrin-specific protease 8
Ligand
BDBM84082
Substrate
Meas. Tech.
SAR Analysis of small molecule inhibitors of Sentrin-specific protease 8 (SENP8) using a Luminescent assay - Set 2
IC50
>99000±n/a nM
Citation
 PubChem, PC SAR Analysis of small molecule inhibitors of Sentrin-specific protease 8 (SENP8) using a Luminescent assay - Set 2 PubChem Bioassay (2011)[AID] 
Target
Name:
Sentrin-specific protease 8
Synonyms:
DEN1 PRSC2 SENP8_HUMAN | SUMO/sentrin specific peptidase family member 8
Type:
Enzyme Catalytic Domain
Mol. Mass.:
24104.52
Organism:
Homo sapiens (Human)
Description:
gi_262118306
Residue:
212
  
Inhibitor
Name:
BDBM84082
Synonyms:
1-(1,4-dioxa-8-azaspiro[4.5]decan-8-yl)-2-(2-methyl-1H-indol-3-yl)ethane-1,2-dione cid_7117504
Type:
Small organic molecule
Emp. Form.:
C18H20N2O4
Mol. Mass.:
328.3624
SMILES:
Cc1[nH]c2ccccc2c1C(=O)C(=O)N1CCC2(CC1)OCCO2
: