Target
Endoribonuclease toxin MazF
Ligand
BDBM83682
Substrate
Meas. Tech.
SAR analysis of small molecule activators of the MazEF TA System via a fluorescence-based single-stranded RNase assay
EC50
5150±n/a nM
Citation
 PubChem, PC SAR analysis of small molecule activators of the MazEF TA System via a fluorescence-based single-stranded RNase assay PubChem Bioassay (2011)[AID] 
Target
Name:
Endoribonuclease toxin MazF
Synonyms:
MAZF_ECOLI chpAK mazF
Type:
Enzyme Catalytic Domain
Mol. Mass.:
12100.43
Organism:
Escherichia coli str. K-12 substr. MG1655
Description:
gi_16130689
Residue:
111
  
Inhibitor
Name:
BDBM83682
Synonyms:
2-(3-Cyano-quinolin-2-ylsulfanyl)-N-(2-morpholin-4-yl-phenyl)-acetamide 2-(3-cyanoquinolin-2-yl)sulfanyl-N-(2-morpholin-4-ylphenyl)ethanamide 2-[(3-cyano-2-quinolyl)thio]-N-(2-morpholinophenyl)acetamide SMR000007880 | cid_648877
Type:
Small organic molecule
Emp. Form.:
C22H20N4O2S
Mol. Mass.:
404.485
SMILES:
O=C(CSc1nc2ccccc2cc1C#N)Nc1ccccc1N1CCOCC1
: