Target
Multidrug resistance protein CDR2
Ligand
BDBM84113
Substrate
Meas. Tech.
Dose Response HTS singleplex for inhibitors of yeast efflux pump, specifically Cdr2 with Hit compounds from Cherry Pick1
EC50
15200±n/a nM
Citation
 PubChem, PC Dose Response HTS singleplex for inhibitors of yeast efflux pump, specifically Cdr2 with Hit compounds from Cherry Pick1 PubChem Bioassay (2011)[AID] 
Target
Name:
Multidrug resistance protein CDR2
Synonyms:
CDR2 drug resistance protein 2
Type:
Enzyme Catalytic Domain
Mol. Mass.:
168970.05
Organism:
Candida albicans
Description:
P78595
Residue:
1499
  
Inhibitor
Name:
BDBM84113
Synonyms:
3-[2-(2,4-Dimethyl-phenoxy)-ethyl]-2-(4-methoxy-phenyl)-3H-quinazolin-4-one 3-[2-(2,4-dimethylphenoxy)ethyl]-2-(4-methoxyphenyl)quinazolin-4-one SMR000218460 | cid_1839665
Type:
Small organic molecule
Emp. Form.:
C25H24N2O3
Mol. Mass.:
400.4697
SMILES:
COc1ccc(cc1)-c1nc2ccccc2c(=O)n1CCOc1ccc(C)cc1C
: