Target
Multidrug resistance protein CDR2
Ligand
BDBM84115
Substrate
Meas. Tech.
Dose Response HTS singleplex for inhibitors of yeast efflux pump, specifically Cdr2 with Hit compounds from Cherry Pick1
EC50
25800±n/a nM
Citation
 PubChem, PC Dose Response HTS singleplex for inhibitors of yeast efflux pump, specifically Cdr2 with Hit compounds from Cherry Pick1 PubChem Bioassay (2011)[AID] 
Target
Name:
Multidrug resistance protein CDR2
Synonyms:
CDR2 drug resistance protein 2
Type:
Enzyme Catalytic Domain
Mol. Mass.:
168970.05
Organism:
Candida albicans
Description:
P78595
Residue:
1499
  
Inhibitor
Name:
BDBM84115
Synonyms:
(E)-N-[2-(4-fluorophenyl)ethyl]-3-(2-nitrophenyl)-2-propenamide (E)-N-[2-(4-fluorophenyl)ethyl]-3-(2-nitrophenyl)prop-2-enamide SMR000292299 | cid_890666
Type:
Small organic molecule
Emp. Form.:
C17H15FN2O3
Mol. Mass.:
314.311
SMILES:
[O-][N+](=O)c1ccccc1\C=C\C(=O)NCCc1ccc(F)cc1
: