Target
Multidrug resistance protein CDR2
Ligand
BDBM79375
Substrate
Meas. Tech.
Dose Response HTS singleplex for inhibitors of yeast efflux pump, specifically Cdr2 with Hit compounds from Cherry Pick1
EC50
870±n/a nM
Citation
 PubChem, PC Dose Response HTS singleplex for inhibitors of yeast efflux pump, specifically Cdr2 with Hit compounds from Cherry Pick1 PubChem Bioassay (2011)[AID] 
Target
Name:
Multidrug resistance protein CDR2
Synonyms:
CDR2 drug resistance protein 2
Type:
Enzyme Catalytic Domain
Mol. Mass.:
168970.05
Organism:
Candida albicans
Description:
P78595
Residue:
1499
  
Inhibitor
Name:
BDBM79375
Synonyms:
1-[2-[4-[5-methoxy-2-(2-methoxyphenyl)-1-benzothiophen-3-yl]phenoxy]ethyl]pyrrolidine MLS002473617 cid_44202261
Type:
Small organic molecule
Emp. Form.:
C28H29NO3S
Mol. Mass.:
459.6
SMILES:
COc1ccc2sc(c(-c3ccc(OCCN4CCCC4)cc3)c2c1)-c1ccccc1OC
: