Target
Multidrug resistance protein CDR2
Ligand
BDBM84122
Substrate
Meas. Tech.
Dose Response HTS singleplex for inhibitors of yeast efflux pump, specifically Cdr2 with Hit compounds from Cherry Pick1
EC50
10200±n/a nM
Citation
 PubChem, PC Dose Response HTS singleplex for inhibitors of yeast efflux pump, specifically Cdr2 with Hit compounds from Cherry Pick1 PubChem Bioassay (2011)[AID] 
Target
Name:
Multidrug resistance protein CDR2
Synonyms:
CDR2 drug resistance protein 2
Type:
Enzyme Catalytic Domain
Mol. Mass.:
168970.05
Organism:
Candida albicans
Description:
P78595
Residue:
1499
  
Inhibitor
Name:
BDBM84122
Synonyms:
2-[4-[5-methoxy-2-(2-methoxyphenyl)-1-benzothiophen-3-yl]phenoxy]-N,N-dimethyl-ethanamine 2-[4-[5-methoxy-2-(2-methoxyphenyl)benzothiophen-3-yl]phenoxy]ethyl-dimethyl-amine SMR001522214 | cid_44601948
Type:
Small organic molecule
Emp. Form.:
C26H27NO3S
Mol. Mass.:
433.562
SMILES:
COc1ccc2sc(c(-c3ccc(OCCN(C)C)cc3)c2c1)-c1ccccc1OC
: