Target
Multidrug resistance protein CDR1
Ligand
BDBM55148
Substrate
Meas. Tech.
Dose Response HTS singleplex for inhibitors of yeast efflux pump, specifically Cdr1 with Hit compounds from Cherry Pick1
EC50
6000±n/a nM
Citation
 PubChem, PC Dose Response HTS singleplex for inhibitors of yeast efflux pump, specifically Cdr1 with Hit compounds from Cherry Pick1 PubChem Bioassay (2011)[AID] 
Target
Name:
Multidrug resistance protein CDR1
Synonyms:
CDR1 Multidrug resistance protein CDR1 | drug resistance protein 1
Type:
PROTEIN
Mol. Mass.:
169942.67
Organism:
Candida albicans
Description:
ChEMBL_708756
Residue:
1501
  
Inhibitor
Name:
BDBM55148
Synonyms:
5-(1H-indol-2-ylmethylene)-2-thioxo-hexahydropyrimidine-4,6-quinone 5-(1H-indol-2-ylmethylidene)-2-sulfanylidene-1,3-diazinane-4,6-dione SMR000495894 | cid_5511942
Type:
Small organic molecule
Emp. Form.:
C13H9N3O2S
Mol. Mass.:
271.294
SMILES:
O=C1NC(=S)NC(=O)C1=Cc1cc2ccccc2[nH]1
: