Target
Multidrug resistance protein CDR1
Ligand
BDBM66298
Substrate
Meas. Tech.
Dose Response HTS singleplex for inhibitors of yeast efflux pump, specifically Cdr1 with Hit compounds from Cherry Pick1
EC50
13±n/a nM
Citation
 PubChem, PC Dose Response HTS singleplex for inhibitors of yeast efflux pump, specifically Cdr1 with Hit compounds from Cherry Pick1 PubChem Bioassay (2011)[AID] 
Target
Name:
Multidrug resistance protein CDR1
Synonyms:
CDR1 Multidrug resistance protein CDR1 | drug resistance protein 1
Type:
PROTEIN
Mol. Mass.:
169942.67
Organism:
Candida albicans
Description:
ChEMBL_708756
Residue:
1501
  
Inhibitor
Name:
BDBM66298
Synonyms:
2-[[4-(4-fluorophenyl)-5-[(1-methylpyrrol-2-yl)methyl]-1,2,4-triazol-3-yl]thio]-N-p-phenetyl-acetamide N-(4-ethoxyphenyl)-2-[[4-(4-fluorophenyl)-5-[(1-methyl-2-pyrrolyl)methyl]-1,2,4-triazol-3-yl]thio]acetamide N-(4-ethoxyphenyl)-2-[[4-(4-fluorophenyl)-5-[(1-methylpyrrol-2-yl)methyl]-1,2,4-triazol-3-yl]sulfanyl]ethanamide cid_5308194
Type:
Small organic molecule
Emp. Form.:
C24H24FN5O2S
Mol. Mass.:
465.543
SMILES:
CCOc1ccc(NC(=O)CSc2nnc(Cc3cccn3C)n2-c2ccc(F)cc2)cc1
: