Target
Multidrug efflux pump
Ligand
BDBM84136
Substrate
Meas. Tech.
Dose Response HTS singleplex for inhibitors of yeast efflux pump, specifically Mdr1 with Hit compounds from Cherry Pick1
EC50
31700±n/a nM
Citation
 PubChem, PC Dose Response HTS singleplex for inhibitors of yeast efflux pump, specifically Mdr1 with Hit compounds from Cherry Pick1 PubChem Bioassay (2011)[AID] 
Target
Name:
Multidrug efflux pump
Synonyms:
Candida albicans strain ATCC 10261 multidrug efflux pump (MDR1) gene, MDR1-A allele, complete cds
Type:
Enzyme Catalytic Domain
Mol. Mass.:
62915.82
Organism:
Candida albicans
Description:
Q09GR2
Residue:
564
  
Inhibitor
Name:
BDBM84136
Synonyms:
MLS000877345 cid_16682183
Type:
Small organic molecule
Emp. Form.:
C25H24ClFN2O4
Mol. Mass.:
470.92
SMILES:
CC(C)C(=O)N1CCC2(CC1)Oc1ccc(F)cc1C(=O)C21CC(=NO1)c1ccc(Cl)cc1
: