Target
Multidrug efflux pump
Ligand
BDBM51250
Substrate
Meas. Tech.
Dose Response HTS singleplex for inhibitors of yeast efflux pump, specifically Mdr1 with Hit compounds from Cherry Pick1
EC50
3320±n/a nM
Citation
 PubChem, PC Dose Response HTS singleplex for inhibitors of yeast efflux pump, specifically Mdr1 with Hit compounds from Cherry Pick1 PubChem Bioassay (2011)[AID] 
Target
Name:
Multidrug efflux pump
Synonyms:
Candida albicans strain ATCC 10261 multidrug efflux pump (MDR1) gene, MDR1-A allele, complete cds
Type:
Enzyme Catalytic Domain
Mol. Mass.:
62915.82
Organism:
Candida albicans
Description:
Q09GR2
Residue:
564
  
Inhibitor
Name:
BDBM51250
Synonyms:
MLS000737421 N,N-diethyl-4-[2-(4-phenylquinolin-2-yl)ethenyl]aniline cid_224744 | diethyl-[4-[2-(4-phenyl-2-quinolyl)vinyl]phenyl]amine
Type:
Small organic molecule
Emp. Form.:
C27H26N2
Mol. Mass.:
378.5087
SMILES:
CCN(CC)c1ccc(C=Cc2cc(-c3ccccc3)c3ccccc3n2)cc1
: