Target
Multidrug efflux pump
Ligand
BDBM74264
Substrate
Meas. Tech.
Dose Response HTS singleplex for inhibitors of yeast efflux pump, specifically Mdr1 with Hit compounds from Cherry Pick1
EC50
704±n/a nM
Citation
 PubChem, PC Dose Response HTS singleplex for inhibitors of yeast efflux pump, specifically Mdr1 with Hit compounds from Cherry Pick1 PubChem Bioassay (2011)[AID] 
Target
Name:
Multidrug efflux pump
Synonyms:
Candida albicans strain ATCC 10261 multidrug efflux pump (MDR1) gene, MDR1-A allele, complete cds
Type:
Enzyme Catalytic Domain
Mol. Mass.:
62915.82
Organism:
Candida albicans
Description:
Q09GR2
Residue:
564
  
Inhibitor
Name:
BDBM74264
Synonyms:
4-methyl-3-(4-morpholinylsulfonyl)benzoic acid [2-(2,5-dimethylphenyl)-2-oxoethyl] ester MLS002169041 [2-(2,5-dimethylphenyl)-2-oxidanylidene-ethyl] 4-methyl-3-morpholin-4-ylsulfonyl-benzoate cid_3879364
Type:
Small organic molecule
Emp. Form.:
C22H25NO6S
Mol. Mass.:
431.502
SMILES:
Cc1ccc(C)c(c1)C(=O)COC(=O)c1ccc(C)c(c1)S(=O)(=O)N1CCOCC1
: