Target
Multidrug efflux pump
Ligand
BDBM54667
Substrate
Meas. Tech.
Dose Response HTS singleplex for inhibitors of yeast efflux pump, specifically Mdr1 with Hit compounds from Cherry Pick1
EC50
22600±n/a nM
Citation
 PubChem, PC Dose Response HTS singleplex for inhibitors of yeast efflux pump, specifically Mdr1 with Hit compounds from Cherry Pick1 PubChem Bioassay (2011)[AID] 
Target
Name:
Multidrug efflux pump
Synonyms:
Candida albicans strain ATCC 10261 multidrug efflux pump (MDR1) gene, MDR1-A allele, complete cds
Type:
Enzyme Catalytic Domain
Mol. Mass.:
62915.82
Organism:
Candida albicans
Description:
Q09GR2
Residue:
564
  
Inhibitor
Name:
BDBM54667
Synonyms:
4-[3-(4-methoxyphenyl)-5-[2-(trifluoromethyl)phenyl]-3,4-dihydropyrazol-2-yl]benzenesulfonamide KUC103474N | cid_44216837
Type:
Small organic molecule
Emp. Form.:
C23H20F3N3O3S
Mol. Mass.:
475.483
SMILES:
COc1ccc(cc1)C1CC(=NN1c1ccc(cc1)S(N)(=O)=O)c1ccccc1C(F)(F)F
: