Target
Potassium voltage-gated channel subfamily KQT member 2
Ligand
BDBM84160
Substrate
Meas. Tech.
Dose response assay for compounds that inhibit KCNQ2 potassium channels on automated electrophysiological assay II
IC50
210.48±148.02 nM
Citation
 PubChem, PC Dose response assay for compounds that inhibit KCNQ2 potassium channels on automated electrophysiological assay II PubChem Bioassay (2011)[AID] 
Target
Name:
Potassium voltage-gated channel subfamily KQT member 2
Synonyms:
KCNQ2_RAT Voltage-gated potassium channel subunit Kv7.2 | potassium voltage-gated channel, KQT-like subfamily, member 2
Type:
PROTEIN
Mol. Mass.:
93984.01
Organism:
Rattus norvegicus
Description:
EBI_100117
Residue:
852
  
Inhibitor
Name:
BDBM84160
Synonyms:
4-methyl-N-[3-methyl-1-(o-anisylcarbamoyl)butyl]cyclohexanecarboxamide N-[1-[(2-methoxyphenyl)methylamino]-4-methyl-1-oxidanylidene-pentan-2-yl]-4-methyl-cyclohexane-1-carboxamide N-[1-[(2-methoxyphenyl)methylamino]-4-methyl-1-oxopentan-2-yl]-4-methylcyclohexane-1-carboxamide cid_9551525
Type:
Small organic molecule
Emp. Form.:
C22H34N2O3
Mol. Mass.:
374.517
SMILES:
COc1ccccc1CNC(=O)C(CC(C)C)NC(=O)C1CCC(C)CC1
: