Target
Potassium voltage-gated channel subfamily KQT member 2
Ligand
BDBM84173
Substrate
Meas. Tech.
Dose response assay for compounds that inhibit KCNQ2 potassium channels on automated electrophysiological assay II
IC50
2960±2222.66 nM
Citation
 PubChem, PC Dose response assay for compounds that inhibit KCNQ2 potassium channels on automated electrophysiological assay II PubChem Bioassay (2011)[AID] 
Target
Name:
Potassium voltage-gated channel subfamily KQT member 2
Synonyms:
KCNQ2_RAT Voltage-gated potassium channel subunit Kv7.2 | potassium voltage-gated channel, KQT-like subfamily, member 2
Type:
PROTEIN
Mol. Mass.:
93984.01
Organism:
Rattus norvegicus
Description:
EBI_100117
Residue:
852
  
Inhibitor
Name:
BDBM84173
Synonyms:
MLS000776547 N-[5-(diethylsulfamoyl)-2-morpholin-4-yl-phenyl]-2-phenoxy-ethanamide N-[5-(diethylsulfamoyl)-2-morpholino-phenyl]-2-phenoxy-acetamide cid_4314906
Type:
Small organic molecule
Emp. Form.:
C22H29N3O5S
Mol. Mass.:
447.548
SMILES:
CCN(CC)S(=O)(=O)c1ccc(N2CCOCC2)c(NC(=O)COc2ccccc2)c1
: