Target
Potassium voltage-gated channel subfamily KQT member 2
Ligand
BDBM84186
Substrate
Meas. Tech.
Dose response assay for compounds that inhibit KCNQ2 potassium channels on automated electrophysiological assay II
IC50
589.85±381.74 nM
Citation
 PubChem, PC Dose response assay for compounds that inhibit KCNQ2 potassium channels on automated electrophysiological assay II PubChem Bioassay (2011)[AID] 
Target
Name:
Potassium voltage-gated channel subfamily KQT member 2
Synonyms:
KCNQ2_RAT Voltage-gated potassium channel subunit Kv7.2 | potassium voltage-gated channel, KQT-like subfamily, member 2
Type:
PROTEIN
Mol. Mass.:
93984.01
Organism:
Rattus norvegicus
Description:
EBI_100117
Residue:
852
  
Inhibitor
Name:
BDBM84186
Synonyms:
MLS001157673 N-[2-(3,4-dimethoxyphenyl)ethyl]-N-methyl-2-(4-methylphenyl)quinoline-4-carboxamide SMR000688184 | cid_24819743
Type:
Small organic molecule
Emp. Form.:
C28H28N2O3
Mol. Mass.:
440.5335
SMILES:
COc1ccc(CCN(C)C(=O)c2cc(nc3ccccc23)-c2ccc(C)cc2)cc1OC
: