Target
Potassium voltage-gated channel subfamily KQT member 2
Ligand
BDBM84187
Substrate
Meas. Tech.
Dose response assay for compounds that inhibit KCNQ2 potassium channels on automated electrophysiological assay II
IC50
1832.42±398.98 nM
Citation
 PubChem, PC Dose response assay for compounds that inhibit KCNQ2 potassium channels on automated electrophysiological assay II PubChem Bioassay (2011)[AID] 
Target
Name:
Potassium voltage-gated channel subfamily KQT member 2
Synonyms:
KCNQ2_RAT Voltage-gated potassium channel subunit Kv7.2 | potassium voltage-gated channel, KQT-like subfamily, member 2
Type:
PROTEIN
Mol. Mass.:
93984.01
Organism:
Rattus norvegicus
Description:
EBI_100117
Residue:
852
  
Inhibitor
Name:
BDBM84187
Synonyms:
2-hydroxybenzoic acid [2-[benzyl(phenethyl)amino]-2-keto-ethyl] ester MLS001078255 [2-[benzyl(2-phenylethyl)amino]-2-oxoethyl] 2-hydroxybenzoate cid_7890742
Type:
Small organic molecule
Emp. Form.:
C24H23NO4
Mol. Mass.:
389.4437
SMILES:
Oc1ccccc1C(=O)OCC(=O)N(CCc1ccccc1)Cc1ccccc1
: