Target
Beta-2 adrenergic receptor
Ligand
BDBM40982
Substrate
Meas. Tech.
Dose response for HTS for Beta-2AR agonists via FAP method from CP1
EC50
92.7±n/a nM
Citation
 PubChem, PC Dose response for HTS for Beta-2AR agonists via FAP method from CP1 PubChem Bioassay (2011)[AID] 
Target
Name:
Beta-2 adrenergic receptor
Synonyms:
ADRB2 ADRB2_HUMAN Beta-2 adrenoceptor | Beta-2 adrenoreceptor
Type:
Mol. Mass.:
46461.69
Organism:
Homo sapiens (Human)
Description:
P07550
Residue:
413
  
Inhibitor
Name:
BDBM40982
Synonyms:
2-(2,4-dimethylphenoxy)-N-(4-[1,3]oxazolo[4,5-b]pyridin-2-ylphenyl)acetamide 2-(2,4-dimethylphenoxy)-N-[4-(2-oxazolo[4,5-b]pyridinyl)phenyl]acetamide 2-(2,4-dimethylphenoxy)-N-[4-([1,3]oxazolo[4,5-b]pyridin-2-yl)phenyl]ethanamide SMR000070681 | cid_1371669
Type:
Small organic molecule
Emp. Form.:
C22H19N3O3
Mol. Mass.:
373.4046
SMILES:
Cc1ccc(OCC(=O)Nc2ccc(cc2)-c2nc3ncccc3o2)c(C)c1
: