Target
Beta-2 adrenergic receptor
Ligand
BDBM84221
Substrate
Meas. Tech.
Dose response for HTS for Beta-2AR agonists via FAP method from CP1
EC50
3600±n/a nM
Citation
 PubChem, PC Dose response for HTS for Beta-2AR agonists via FAP method from CP1 PubChem Bioassay (2011)[AID] 
Target
Name:
Beta-2 adrenergic receptor
Synonyms:
ADRB2 ADRB2_HUMAN Beta-2 adrenoceptor | Beta-2 adrenoreceptor
Type:
Mol. Mass.:
46461.69
Organism:
Homo sapiens (Human)
Description:
P07550
Residue:
413
  
Inhibitor
Name:
BDBM84221
Synonyms:
MLS000594071 N-[4-[4-methyl-5-[(4-methylbenzyl)thio]-1,2,4-triazol-3-yl]phenyl]acetamide N-[4-[4-methyl-5-[(4-methylphenyl)methylsulfanyl]-1,2,4-triazol-3-yl]phenyl]ethanamide SMR000143130 | cid_1236197
Type:
Small organic molecule
Emp. Form.:
C19H20N4OS
Mol. Mass.:
352.453
SMILES:
CC(=O)Nc1ccc(cc1)-c1nnc(SCc2ccc(C)cc2)n1C
: