Target
Beta-2 adrenergic receptor
Ligand
BDBM84224
Substrate
Meas. Tech.
Dose response for HTS for Beta-2AR agonists via FAP method from CP1
EC50
973±n/a nM
Citation
 PubChem, PC Dose response for HTS for Beta-2AR agonists via FAP method from CP1 PubChem Bioassay (2011)[AID] 
Target
Name:
Beta-2 adrenergic receptor
Synonyms:
ADRB2 ADRB2_HUMAN Beta-2 adrenoceptor | Beta-2 adrenoreceptor
Type:
Mol. Mass.:
46461.69
Organism:
Homo sapiens (Human)
Description:
P07550
Residue:
413
  
Inhibitor
Name:
BDBM84224
Synonyms:
MLS000521296 N-[4-[5-[1-(2,4-dichlorophenoxy)ethyl]-1,2,4-oxadiazol-3-yl]phenyl]picolinamide N-[4-[5-[1-[2,4-bis(chloranyl)phenoxy]ethyl]-1,2,4-oxadiazol-3-yl]phenyl]pyridine-2-carboxamide cid_5085262
Type:
Small organic molecule
Emp. Form.:
C22H16Cl2N4O3
Mol. Mass.:
455.293
SMILES:
CC(Oc1ccc(Cl)cc1Cl)c1nc(no1)-c1ccc(NC(=O)c2ccccn2)cc1
: