Target
Beta-2 adrenergic receptor
Ligand
BDBM55475
Substrate
Meas. Tech.
Dose response for HTS for Beta-2AR agonists via FAP method from CP1
EC50
83400±n/a nM
Citation
 PubChem, PC Dose response for HTS for Beta-2AR agonists via FAP method from CP1 PubChem Bioassay (2011)[AID] 
Target
Name:
Beta-2 adrenergic receptor
Synonyms:
ADRB2 ADRB2_HUMAN Beta-2 adrenoceptor | Beta-2 adrenoreceptor
Type:
Mol. Mass.:
46461.69
Organism:
Homo sapiens (Human)
Description:
P07550
Residue:
413
  
Inhibitor
Name:
BDBM55475
Synonyms:
2-[(2,5-dimethylbenzyl)sulfanyl]-6,7-dimethoxy-3-(4-methoxybenzyl)-4(3H)-quinazolinimine 2-[(2,5-dimethylphenyl)methylthio]-6,7-dimethoxy-3-[(4-methoxyphenyl)methyl]-4-quinazolinimine SMR000180141 cid_1482680
Type:
Small organic molecule
Emp. Form.:
C27H29N3O3S
Mol. Mass.:
475.602
SMILES:
COc1ccc(Cn2c(SCc3cc(C)ccc3C)nc3cc(OC)c(OC)cc3c2=N)cc1
: