Target
Beta-2 adrenergic receptor
Ligand
BDBM84252
Substrate
Meas. Tech.
Dose response for HTS for Beta-2AR agonists via FAP method from CP1
EC50
91.9±n/a nM
Citation
 PubChem, PC Dose response for HTS for Beta-2AR agonists via FAP method from CP1 PubChem Bioassay (2011)[AID] 
Target
Name:
Beta-2 adrenergic receptor
Synonyms:
ADRB2 ADRB2_HUMAN Beta-2 adrenoceptor | Beta-2 adrenoreceptor
Type:
Mol. Mass.:
46461.69
Organism:
Homo sapiens (Human)
Description:
P07550
Residue:
413
  
Inhibitor
Name:
BDBM84252
Synonyms:
(5-Furan-2-yl-2,2-dimethyl-1,4-dihydro-2H-3-oxa-7-thia-6,9,11-triaza-benzo[c]fluoren-8-yl)-(tetrahydro-furan-2-ylmethyl)-amine SMR000220652 | cid_3271684
Type:
Small organic molecule
Emp. Form.:
C23H24N4O3S
Mol. Mass.:
436.527
SMILES:
CC1(C)Cc2c(CO1)c(nc1sc3c(NCC4CCCO4)ncnc3c21)-c1ccco1
: