Target
Beta-2 adrenergic receptor
Ligand
BDBM73035
Substrate
Meas. Tech.
Dose response for HTS for Beta-2AR agonists via FAP method from Powderset1
EC50
152.2±n/a nM
Citation
 PubChem, PC Dose response for HTS for Beta-2AR agonists via FAP method from Powderset1 PubChem Bioassay (2011)[AID] 
Target
Name:
Beta-2 adrenergic receptor
Synonyms:
ADRB2 ADRB2_HUMAN Beta-2 adrenoceptor | Beta-2 adrenoreceptor
Type:
Mol. Mass.:
46461.69
Organism:
Homo sapiens (Human)
Description:
P07550
Residue:
413
  
Inhibitor
Name:
BDBM73035
Synonyms:
5-Nitro-furan-2-carboxylic acid (4-oxazolo[4,5-b]pyridin-2-yl-phenyl)-amide 5-nitro-N-[4-(2-oxazolo[4,5-b]pyridinyl)phenyl]-2-furancarboxamide MLS001224198 cid_1104203
Type:
Small organic molecule
Emp. Form.:
C17H10N4O5
Mol. Mass.:
350.2851
SMILES:
[O-][N+](=O)c1ccc(o1)C(=O)Nc1ccc(cc1)-c1nc2ncccc2o1
: