Target
1-deoxy-D-xylulose 5-phosphate reductoisomerase
Ligand
BDBM84559
Substrate
Meas. Tech.
Inhibition Assay
pH
8±0
Temperature
310.15±0 K
Ki
750000±210000 nM
Citation
 Mercklé, Lde Andrés-Gómez, ADick, BCox, RJGodfrey, CR A fragment-based approach to understanding inhibition of 1-deoxy-D-xylulose-5-phosphate reductoisomerase. Chembiochem 6:1866-74 (2005)  
Target
Name:
1-deoxy-D-xylulose 5-phosphate reductoisomerase
Synonyms:
1-Deoxy-D-xylulose 5-phosphate reductoisomerase (DXP) 1-deoxy-D-xylulose 5-phosphate reductoisomerase (DXR) DXP reductoisomerase dxr yaeM
Type:
Protein
Mol. Mass.:
43384.52
Organism:
Escherichia coli
Description:
P45568
Residue:
398
  
Inhibitor
Name:
BDBM84559
Synonyms:
Phosphate analogue, (s)-14
Type:
Small organic molecule
Emp. Form.:
C4H8NO7P
Mol. Mass.:
213.0826
SMILES:
ON1[C@H](COP(O)(O)=O)COC1=O
: