Target
Phosphatidylinositol 4,5-bisphosphate 3-kinase catalytic subunit beta isoform
Ligand
BDBM50239124
Substrate
Meas. Tech.
ChEMBL_1665253 (CHEMBL4015049)
IC50
6.7±n/a nM
Citation
 Barlaam, BCosulich, SDegorce, SEllston, RFitzek, MGreen, SHancox, ULambert-van der Brempt, CLohmann, JJMaudet, MMorgentin, RPlé, PWard, LWarin, N Discovery of a series of 8-(1-phenylpyrrolidin-2-yl)-6-carboxamide-2-morpholino-4H-chromen-4-one as PI3K?/? inhibitors for the treatment of PTEN-deficient tumours. Bioorg Med Chem Lett 27:1949-1954 (2017)  
Target
Name:
Phosphatidylinositol 4,5-bisphosphate 3-kinase catalytic subunit beta isoform
Synonyms:
PI3-kinase p110 subunit beta PI3Kbeta PIK3CB Phosphatidylinositol 4,5-bisphosphate 3-kinase catalytic subunit beta (PI3Kbeta) Phosphatidylinositol 4,5-bisphosphate 3-kinase catalytic subunit beta isoform (PI3K) Phosphatidylinositol 4,5-bisphosphate 3-kinase catalytic subunit beta isoform (PI3Kbeta) Phosphatidylinositol-4,5-bisphosphate 3-kinase catalytic subunit beta isoform Phosphoinositide 3-Kinase (PI3K), beta Chain A PtdIns-3-kinase p110
Type:
Enzyme Subunit
Mol. Mass.:
122769.00
Organism:
Homo sapiens (Human)
Description:
P42338
Residue:
1070
  
Inhibitor
Name:
BDBM50239124
Synonyms:
CHEMBL4102511
Type:
Small organic molecule
Emp. Form.:
C26H28FN3O4
Mol. Mass.:
465.5166
SMILES:
CN(C)C(=O)c1cc([C@H]2CCCN2c2ccc(F)cc2)c2oc(cc(=O)c2c1)N1CCOCC1
: