Target
Phosphatidylinositol 4,5-bisphosphate 3-kinase catalytic subunit gamma isoform
Ligand
BDBM50239118
Substrate
Meas. Tech.
ChEMBL_1665254 (CHEMBL4015050)
IC50
340±n/a nM
Citation
 Barlaam, BCosulich, SDegorce, SEllston, RFitzek, MGreen, SHancox, ULambert-van der Brempt, CLohmann, JJMaudet, MMorgentin, RPlé, PWard, LWarin, N Discovery of a series of 8-(1-phenylpyrrolidin-2-yl)-6-carboxamide-2-morpholino-4H-chromen-4-one as PI3K?/? inhibitors for the treatment of PTEN-deficient tumours. Bioorg Med Chem Lett 27:1949-1954 (2017)  
Target
Name:
Phosphatidylinositol 4,5-bisphosphate 3-kinase catalytic subunit gamma isoform
Synonyms:
PI3-kinase p110 subunit gamma PI3Kgamma PK3CG_HUMAN Phosphatidylinositol 4,5-bisphosphate 3-kinase (PI3K) Phosphatidylinositol 4,5-bisphosphate 3-kinase catalytic subunit gamma (PI3Kgamma) Phosphatidylinositol 4,5-bisphosphate 3-kinase catalytic subunit gamma isoform (PI3K) Phosphatidylinositol-4,5-bisphosphate 3-kinase catalytic subunit gamma isoform Phosphoinositide 3-kinases gamma (PI3K gamma) p120-PI3K
Type:
Enzyme Subunit
Mol. Mass.:
126470.30
Organism:
Homo sapiens (Human)
Description:
P48736
Residue:
1102
  
Inhibitor
Name:
BDBM50239118
Synonyms:
CHEMBL4090811
Type:
Small organic molecule
Emp. Form.:
C28H30FN3O5
Mol. Mass.:
507.5533
SMILES:
Fc1cccc(c1)N1CCC[C@@H]1c1cc(cc2c1oc(cc2=O)N1CCOCC1)C(=O)N1CCOCC1
: